Home > Runtime Error > Indesign Cs4 Runtime Error R6025

Indesign Cs4 Runtime Error R6025

Contents

If that doesn't work, deactivate, uninstall everything, run the clean script (CS Cleaner Tool for installation problems | CCM, CS6, CS5.5, CS5, CS4, CS3) and reinstall. can I re-install just inDesign???? Change regionUnited States (Change) Choose your region Selecting a region changes the language and/or content on Adobe.com. Beim Beantworten mit OK stürzt Indesign ab.Klingt, als sei diese Geschichte hier ähnlich:http://www.computerhilfen.de/hilfen-7-99842-0.htmlhttp://service1.symantec.com/...0256fe000493457?OpenGruß, Sacha> MacBookPro 17", OSX 10.10.3, CS6 / CC2015mediengestalter.lu • sachaheck.lu als Antwort auf: [#299565] ChristianGlombitza Beiträge: 493 this contact form

Step 4 – Verify that the program that threw the Runtime Error R6025 is not listed on the listing of programs. branch -- take a closer look at the paths in the link.to turn off video acceleration in XP right-click a blank spot onthe desktop, select Properties, then the Settings tab, press ist der Deinstalliert und Norton Virusfinder ist auch nicht installiert. Not the acceleration, renaming the files, the latestest updates have been applied.

Adobe Acrobat Runtime Error C++ Windows 7

Re: error r6025 from Indesign Peter Spier Jun 11, 2013 4:57 PM (in response to 999Rick) I have a feeling that the problem could be related to a Windows update at It's seems like bad code??? CS6 will remain available as a traditionallly licensed product, however). Move the preferences folder to another location (for example, C:\Temp).

This tool uses JavaScript and much of it will not work correctly without it enabled. I would then do a full uninstall of the entire Suite, run the cleaner tool, do a clean boot (run MSConfig and turn off unnecessary startup programs and services see How Do I open explorer and just copy from it?Sent from my Galaxy S®III Like Show 0 Likes(0) Actions 14. R6025 Pure Virtual Function Call Skip navigationSign in0Search forums onlySearch forums onlyCancelForums HomeNewsPeopleProduct Menu beginsAdobe Creative CloudDownloading, Installing, Setting UpAdobe Flash PlayerAcrobat ReaderAdobe PhotoshopAdobe Photoshop LightroomAdobe Photoshop ElementsAdobe Dreamweaver Adobe MuseAdobe Animate CCAdobe Premiere ProAdobe After

Re: error r6025 from Indesign Peter Spier Jun 11, 2013 6:53 AM (in response to 999Rick) Start by replacing the prefs and disabling any third parrty plugins. Adobe Runtime Error For example, Collaboration, JavaScripts, Organizer, Color Settings, AutoFill, Web Capture, Stamps and Updater, and Color Management Settings can be adversely affected or  not reset.To re-create the application preferences folder: Quit the Please try the request again. Re: error r6025 from Indesign Peter Spier Jun 11, 2013 5:28 PM (in response to 999Rick) That's correct.

The error results from a program or application becoming corrupted. Runtime Error R6034 Will I have a licence problem re-installing. You might well want to try CS6 or wait for the CC version on the 17th (CC is a subscription, however, not the traditional license, and the new versiuons will require Looks great!

Adobe Runtime Error

Start now ^Back to top Was this page helpful? Step 7 – Select the “Remove Program” menu option underneath the application that triggered the Runtime Error R6025 and follow the default menu prompts to delete the program. Adobe Acrobat Runtime Error C++ Windows 7 Re: error r6025 from Indesign 999Rick Jun 11, 2013 9:17 AM (in response to Peter Spier) i put the first CD in my computer and the install pop up is displayed Adobe Photoshop Elements 10 Runtime Error Americas Brasil Canada - English Canada - Français Latinoamérica México United States Europe, Middle East and Africa Africa - English België Belgique Belgium - English Česká republika Cyprus - English Danmark

Foren|Tutorials|Jobs| HDS-Service|HDS-Werbepartner|Richtlinien|Impressum Lesezeichen | Suche | Benutzerliste | FAQ | Mitgliedschaft | Registrieren | Einloggen Gast Wählen Sie ein ForumAktuell/Neuerungen, Feedback Aktuell/Neu Entrypoint - Das Einsteigerforum Feedback weblink This error is occurring after the file is created. Please turn JavaScript back on and reload this page. Step 8 – Exit the Windows Control Panel then click the “Start” menu. Adobe Runtime Error Windows 7

For example, if you are playing a video game hosted online and the server goes down, your computer could generate this error.Step 1Read the Runtime error message to see what program The book will have over 250 pages.I would be crossing my fingers that it completes the .epub file at that point.If it does create the epub file when i convert the So I had a newer more powerful computer not being used. navigate here If you don't, wait until your Internet is running again.

Please advise. C++ Runtime Error Incoming Links Re: InDesign CS6 Runtime Error! Re: error r6025 from Indesign 999Rick Jun 11, 2013 5:41 AM (in response to Peter Spier) Im using CS4 Indesign and all updates for this application have been included.

Re: error r6025 from Indesign 999Rick Jun 11, 2013 3:23 PM (in response to Peter Spier) Please listen...

R6025 - pure virtual function call Zitat Klingt, als sei diese Geschichte hier ähnlich:http://www.computerhilfen.de/hilfen-7-99842-0.htmlhttp://service1.symantec.com/...0256fe000493457?OpenIch verwende keinen MSN Messenger bzw. Error 1603 When installing software that is packaged with the Windows Installer, users may get an error ... Click "OK" to close the error message window.Step 2Hold down the Ctrl and Shift keys and press the Esc key to launch Task Manager.Step 3Click the "Processes" tab and click on Microsoft Visual C++ Runtime Library If you determine that the preferences file is not causing the problem, then you can restore your custom settings by following the instructions below.To re-create the product preferences file: Quit the

SHould I have one of the for CS4?By the way in the one link you sent... Time is short on this project! Beim Beantworten mit OK stürzt Indesign ab.Das Dokument wurde aus CS2 übernommen und zu einem Buch gesplittet. http://cdhca.org/runtime-error/indesign-cs6-runtime-error.php There is a small chance, though, that you will be no better off, and possibly worse, so you need to make that choice.

was sagt diese Meldung?Verwende WinXP SP2, Intel Core2 6600 2,4GHz, 2 GB RAMVielen Dank im voraus.lgChristianOffice: Win7 x64 SP1, CS4Home: Win7 x64 SP1, CS6>>> Geben und nehmen gilt auch in diesem No menu pops up. R6025 - pure virtual function call Hallo,habe da nun mit dem ursprünglichen Gesamtdokument getestet.Inhaltsverzeichnis funktioniert.Habe nun Probehalber dieses Dokument nochmals unter anderem Namen gespeichert und die zwei Files als Buch zusammengesetzt.--> I'm not sure what the status is on upgrade pricing for CS6, but your CS4 will qualify you for a first-year discount on a subscription to Creative Cloud and the CC

Remember meLog InCancelBy signing up or using the Techwalla services you agree to the Techwalla Terms of Use and Privacy PolicySign UpLog InCreate an account and join the conversation! It would be quite large. How do I fix this error . Mitgliederbereich Archiv Kommunikation und Medien Adobe Video Produkte Alles um Video-Trainings von Video2Brain Apple iLife - Home Multimedia Apple Video Applikationen Adobe Director Software

Thinking this error was due to the fact that the older computer was not able.... If the problem doesn't recur, then the original user account could be damaged. You may needt to uninstall and reinstall ID to fix this, though. It just says replacing acceleration worked.

Like Show 0 Likes(0) Actions 8. How do you go about this properly? You can not post a blank message.